[vtkusers] Erros while building VTK

Apoorva Ajay Apoorva.Ajay at UTSouthwestern.edu
Thu Aug 10 18:30:36 EDT 2017


I get the below mentioned error when I try building ITKApps, which inturn builds VTK. Kindly help me resolve this.

CMake Error: The following variables are used in this project, but they are set to NOTFOUND.
Please set them or make sure they are set and tested correctly in the CMake files:
   used as include directory in directory /ITKApps_build/VTK/Geovis/Core

-- Configuring incomplete, errors occurred!
See also "/ITKApps_build/VTK/CMakeFiles/CMakeOutput.log".
See also "/ITKApps_build/VTK/CMakeFiles/CMakeError.log".
make[2]: *** [VTK-prefix/src/VTK-stamp/VTK-configure] Error 1
make[1]: *** [CMakeFiles/VTK.dir/all] Error 2
make: *** [all] Error 2

How can I find OPENGL_INCLUDE_DIR on my system, please advice.

Thanks and Best Regards,

UT Southwestern

Medical Center

The future of medicine, today.

-------------- next part --------------
An HTML attachment was scrubbed...
URL: <http://public.kitware.com/pipermail/vtkusers/attachments/20170810/c5fa0e02/attachment.html>

More information about the vtkusers mailing list