[vtkusers] VTK Building Error On Solaris x86

vijaeendra simha vijaeendra at gmail.com
Tue Aug 23 05:17:13 EDT 2011

I m also getting the following error when I try to compile the 5.4.2

[ 82%] Building CXX object Hybrid/CMakeFiles/vtkHybrid.dir/vtkVRMLImporter.o
"/export/home/vtk-downloads/VTK/Hybrid/vtkVRMLImporter.cxx", line 1110:
Error: Too many arguments in call to "alloca()".
"/export/home/vtk-downloads/VTK/Hybrid/vtkVRMLImporter.cxx", line 1112:
Error: Too many arguments in call to "alloca()".
2 Error(s) detected.
gmake[2]: *** [Hybrid/CMakeFiles/vtkHybrid.dir/vtkVRMLImporter.o] Error 2
gmake[1]: *** [Hybrid/CMakeFiles/vtkHybrid.dir/all] Error 2
gmake: *** [all] Error 2

Please help me

Vijaeendra Simha G A
-------------- next part --------------
An HTML attachment was scrubbed...
URL: <http://www.vtk.org/pipermail/vtkusers/attachments/20110823/12b39e4e/attachment.htm>

More information about the vtkusers mailing list