[Insight-users] Error when compiling FLTK 1.1.7

Kannan U V kannanuv at cs.utah.edu
Wed Oct 10 20:03:05 EDT 2007

I am trying to build FLTK 1.1.7. when I run the make I receive the following


/home/collab/kannanuv/fltk-1.1.7/test/cursor.cxx: In function 'void
choice_cb(Fl_Widget*, void*)':

/home/collab/kannanuv/fltk-1.1.7/test/cursor.cxx:42: error: cast from
'void*' to 'int' loses precision

make[2]: *** [test/CMakeFiles/cursor.dir/cursor.o] Error 1

make[1]: *** [test/CMakeFiles/cursor.dir/all] Error 2

make: *** [all] Error 2


Thanks & Regards,

Kannan U V


-------------- next part --------------
An HTML attachment was scrubbed...
URL: http://public.kitware.com/pipermail/insight-users/attachments/20071010/e500981f/attachment.html

More information about the Insight-users mailing list